{"text_format":"1","workbook":"xlsx","n_sheets":4,"sheets":["入力用シート","使用方法","リスト","標準報酬等級表"],"not_rendered":{"charts":0,"images":0,"macros":1,"external_links":0,"defined_names":3,"comments":0,"pivot_tables":0},"unopened":[],"bounds":{"document_bytes":16777216,"sheet_cells":100000,"rows_first":2000,"rows_last":500,"rows_between":2000,"halvings":0,"cell_chars":16384,"cell_head_chars":4096},"cells_cut":0,"cells_raw":0,"read":"whole","date_system":"1900"}

{"sheet":"入力用シート","index":0,"n_rows":150,"n_cols":51,"rows_kept":150,"cut":false,"hidden":false,"merged":[[4,14,4,16],[5,16,7,16],[5,4,7,4],[5,5,7,5],[5,6,7,6],[5,7,7,7],[5,8,7,8],[5,9,6,10],[5,11,7,11],[5,12,7,12],[5,50,7,50],[5,40,5,45],[5,46,7,46],[5,47,7,47],[5,39,7,39],[5,48,6,49],[1,1,2,6],[5,37,7,37],[5,38,7,38],[5,36,7,36],[5,24,6,26],[5,27,6,29],[5,13,7,13],[5,30,6,32],[5,33,6,35],[5,14,7,14],[5,15,7,15],[5,17,7,17],[5,1,7,1],[5,2,7,2],[5,3,7,3],[4,8,4,12]]}
[]
[null,"・「使用方法」シートを参考に入力してください。"]
[]
[]
[null,null,null,null,null,null,null,null,null,null,null,null,null,null,"入力不要"]
[null,"種類","理由","掛金翌月","所属所","証番号","異動\n事由","処理\n区分","異動\n年月日","氏名",null,"性別","生年\n月日","企業","部課署\n番号","会計支出\n科目","組合員\n種別","従前の\n改定年月",null,null,"従前の標準報酬",null,null,null,"算定基礎月",null,null,"固定的給与",null,null,"非固定的給与",null,null,"合計",null,null,"決定\n方法","情報\nコード","平均額","改定\n事由","標準報酬",null,null,null,null,null,"報酬\n総額","変更\n理由","予備",null,"レイアウト\n区分"]
[null,null,null,null,null,null,null,null,null,null,null,null,null,null,null,null,null,null,"等級","月額","等級","月額","等級","月額",null,null,null,null,null,null,"（１）","（２）","（３）","（１）","（２）","（３）",null,null,null,null,"等級","月額","等級","月額","等級","月額"]
[null,null,null,null,null,null,null,null,null,"（カナ）","（漢字）",null,null,null,null,null,null,null,"（短期）","（短期）","（厚年）","（厚年）","（退職等)","（退職等)","（１）","（２）","（３）","（１）","（２）","（３）","（１）","（２）","（３）","（１）","（２）","（３）",null,null,null,null,"（短期）","（短期）","（厚年）","（厚年）","（退職等)","（退職等)",null,null,"１","２"]
[null,null,null,null,null,null,37,2,null,null,null,null,null,null,null,null,null,null,null,{"$f":"LOOKUP(S9,標準報酬等級表!$A$8:$A$57,標準報酬等級表!$D$8:$D$57)","v":{"$error":"#N/A"}},{"$f":"W9","v":1},{"$f":"LOOKUP(U9,標準報酬等級表!$B$11:$B$42,標準報酬等級表!$D$11:$D$42)","v":88},{"$f":"IF(S9>35,32,IF(S9<4,1,S9-3))","v":1},{"$f":"LOOKUP(W9,標準報酬等級表!$B$11:$B$42,標準報酬等級表!$D$11:$D$42)","v":88},null,null,null,null,null,null,null,null,null,{"$f":"AB9+AE9","v":0},{"$f":"AC9+AF9","v":0},{"$f":"AD9+AG9","v":0},{"$f":"IF(OR(B9=2,B9=4,B9=6),2,0)","v":0},{"$f":"IF(OR(B9=2,B9=7),1,0)","v":0},{"$f":"IF(B9=7,AH9,ROUNDDOWN(AVERAGE(AH9:AJ9),0))","v":0},{"$f":"IF(OR(B9=2,B9=7),4,IF(B9=1,1,IF(OR(B9=3,B9=4),2,3)))","v":3},{"$f":"MATCH($AM9,標準報酬等級表!$F$8:$F$57,1)","v":1},{"$f":"LOOKUP(AO9,標準報酬等級表!$A$8:$A$57,標準報酬等級表!$D$8:$D$57)","v":58},{"$f":"AS9","v":1},{"$f":"LOOKUP(AQ9,標準報酬等級表!$B$11:$B$42,標準報酬等級表!$D$11:$D$42)","v":88},{"$f":"IF(AO9>35,32,IF(AO9<4,1,AO9-3))","v":1},{"$f":"LOOKUP(AS9,標準報酬等級表!$B$11:$B$42,標準報酬等級表!$D$11:$D$42)","v":88},{"$f":"SUM(AH9:AJ9)","v":0},null,null,null,1]
[null,null,null,null,null,null,37,2,null,null,null,null,null,null,null,null,null,null,null,{"$f":"LOOKUP(S10,標準報酬等級表!$A$8:$A$57,標準報酬等級表!$D$8:$D$57)","v":{"$error":"#N/A"}},{"$f":"W10","v":1},{"$f":"LOOKUP(U10,標準報酬等級表!$B$11:$B$42,標準報酬等級表!$D$11:$D$42)","v":88},{"$f":"IF(S10>35,32,IF(S10<4,1,S10-3))","v":1},{"$f":"LOOKUP(W10,標準報酬等級表!$B$11:$B$42,標準報酬等級表!$D$11:$D$42)","v":88},null,null,null,null,null,null,null,null,null,{"$f":"AB10+AE10","v":0},0,0,{"$f":"IF(OR(B10=2,B10=4,B10=6),2,0)","v":0},{"$f":"IF(OR(B10=2,B10=7),1,0)","v":0},{"$f":"IF(B10=7,AH10,ROUNDDOWN(AVERAGE(AH10:AJ10),0))","v":0},{"$f":"IF(OR(B10=2,B10=7),4,IF(B10=1,1,IF(OR(B10=3,B10=4),2,3)))","v":3},{"$f":"MATCH($AM10,標準報酬等級表!$F$8:$F$57,1)","v":1},{"$f":"LOOKUP(AO10,標準報酬等級表!$A$8:$A$57,標準報酬等級表!$D$8:$D$57)","v":58},{"$f":"AS10","v":1},{"$f":"LOOKUP(AQ10,標準報酬等級表!$B$11:$B$42,標準報酬等級表!$D$11:$D$42)","v":88},{"$f":"IF(AO10>35,32,IF(AO10<4,1,AO10-3))","v":1},{"$f":"LOOKUP(AS10,標準報酬等級表!$B$11:$B$42,標準報酬等級表!$D$11:$D$42)","v":88},{"$f":"SUM(AH10:AJ10)","v":0},null,null,null,1]
[null,null,null,null,null,null,37,2,null,null,null,null,null,null,null,null,null,null,null,{"$f":"LOOKUP(S11,標準報酬等級表!$A$8:$A$57,標準報酬等級表!$D$8:$D$57)","v":{"$error":"#N/A"}},1,{"$f":"LOOKUP(U11,標準報酬等級表!$B$11:$B$42,標準報酬等級表!$D$11:$D$42)","v":88},1,{"$f":"LOOKUP(W11,標準報酬等級表!$B$11:$B$42,標準報酬等級表!$D$11:$D$42)","v":88},null,null,null,null,null,null,null,null,null,0,0,0,0,0,0,3,{"$f":"MATCH($AM11,標準報酬等級表!$F$8:$F$57,1)","v":1},{"$f":"LOOKUP(AO11,標準報酬等級表!$A$8:$A$57,標準報酬等級表!$D$8:$D$57)","v":58},1,{"$f":"LOOKUP(AQ11,標準報酬等級表!$B$11:$B$42,標準報酬等級表!$D$11:$D$42)","v":88},1,{"$f":"LOOKUP(AS11,標準報酬等級表!$B$11:$B$42,標準報酬等級表!$D$11:$D$42)","v":88},0,null,null,null,1]
[null,null,null,null,null,null,37,2,null,null,null,null,null,null,null,null,null,null,null,{"$f":"LOOKUP(S12,標準報酬等級表!$A$8:$A$57,標準報酬等級表!$D$8:$D$57)","v":{"$error":"#N/A"}},1,{"$f":"LOOKUP(U12,標準報酬等級表!$B$11:$B$42,標準報酬等級表!$D$11:$D$42)","v":88},1,{"$f":"LOOKUP(W12,標準報酬等級表!$B$11:$B$42,標準報酬等級表!$D$11:$D$42)","v":88},null,null,null,null,null,null,null,null,null,0,0,0,0,0,0,3,{"$f":"MATCH($AM12,標準報酬等級表!$F$8:$F$57,1)","v":1},{"$f":"LOOKUP(AO12,標準報酬等級表!$A$8:$A$57,標準報酬等級表!$D$8:$D$57)","v":58},1,{"$f":"LOOKUP(AQ12,標準報酬等級表!$B$11:$B$42,標準報酬等級表!$D$11:$D$42)","v":88},1,{"$f":"LOOKUP(AS12,標準報酬等級表!$B$11:$B$42,標準報酬等級表!$D$11:$D$42)","v":88},0,null,null,null,1]
[null,null,null,null,null,null,37,2,null,null,null,null,null,null,null,null,null,null,null,{"$f":"LOOKUP(S13,標準報酬等級表!$A$8:$A$57,標準報酬等級表!$D$8:$D$57)","v":{"$error":"#N/A"}},1,{"$f":"LOOKUP(U13,標準報酬等級表!$B$11:$B$42,標準報酬等級表!$D$11:$D$42)","v":88},1,{"$f":"LOOKUP(W13,標準報酬等級表!$B$11:$B$42,標準報酬等級表!$D$11:$D$42)","v":88},null,null,null,null,null,null,null,null,null,0,0,0,0,0,0,3,{"$f":"MATCH($AM13,標準報酬等級表!$F$8:$F$57,1)","v":1},{"$f":"LOOKUP(AO13,標準報酬等級表!$A$8:$A$57,標準報酬等級表!$D$8:$D$57)","v":58},1,{"$f":"LOOKUP(AQ13,標準報酬等級表!$B$11:$B$42,標準報酬等級表!$D$11:$D$42)","v":88},1,{"$f":"LOOKUP(AS13,標準報酬等級表!$B$11:$B$42,標準報酬等級表!$D$11:$D$42)","v":88},0,null,null,null,1]
[null,null,null,null,null,null,37,2,null,null,null,null,null,null,null,null,null,null,null,{"$f":"LOOKUP(S14,標準報酬等級表!$A$8:$A$57,標準報酬等級表!$D$8:$D$57)","v":{"$error":"#N/A"}},1,{"$f":"LOOKUP(U14,標準報酬等級表!$B$11:$B$42,標準報酬等級表!$D$11:$D$42)","v":88},1,{"$f":"LOOKUP(W14,標準報酬等級表!$B$11:$B$42,標準報酬等級表!$D$11:$D$42)","v":88},null,null,null,null,null,null,null,null,null,0,0,0,0,0,0,3,{"$f":"MATCH($AM14,標準報酬等級表!$F$8:$F$57,1)","v":1},{"$f":"LOOKUP(AO14,標準報酬等級表!$A$8:$A$57,標準報酬等級表!$D$8:$D$57)","v":58},1,{"$f":"LOOKUP(AQ14,標準報酬等級表!$B$11:$B$42,標準報酬等級表!$D$11:$D$42)","v":88},1,{"$f":"LOOKUP(AS14,標準報酬等級表!$B$11:$B$42,標準報酬等級表!$D$11:$D$42)","v":88},0,null,null,null,1]
[null,null,null,null,null,null,37,2,null,null,null,null,null,null,null,null,null,null,null,{"$f":"LOOKUP(S15,標準報酬等級表!$A$8:$A$57,標準報酬等級表!$D$8:$D$57)","v":{"$error":"#N/A"}},1,{"$f":"LOOKUP(U15,標準報酬等級表!$B$11:$B$42,標準報酬等級表!$D$11:$D$42)","v":88},1,{"$f":"LOOKUP(W15,標準報酬等級表!$B$11:$B$42,標準報酬等級表!$D$11:$D$42)","v":88},null,null,null,null,null,null,null,null,null,0,0,0,0,0,0,3,{"$f":"MATCH($AM15,標準報酬等級表!$F$8:$F$57,1)","v":1},{"$f":"LOOKUP(AO15,標準報酬等級表!$A$8:$A$57,標準報酬等級表!$D$8:$D$57)","v":58},1,{"$f":"LOOKUP(AQ15,標準報酬等級表!$B$11:$B$42,標準報酬等級表!$D$11:$D$42)","v":88},1,{"$f":"LOOKUP(AS15,標準報酬等級表!$B$11:$B$42,標準報酬等級表!$D$11:$D$42)","v":88},0,null,null,null,1]
[null,null,null,null,null,null,37,2,null,null,null,null,null,null,null,null,null,null,null,{"$f":"LOOKUP(S16,標準報酬等級表!$A$8:$A$57,標準報酬等級表!$D$8:$D$57)","v":{"$error":"#N/A"}},1,{"$f":"LOOKUP(U16,標準報酬等級表!$B$11:$B$42,標準報酬等級表!$D$11:$D$42)","v":88},1,{"$f":"LOOKUP(W16,標準報酬等級表!$B$11:$B$42,標準報酬等級表!$D$11:$D$42)","v":88},null,null,null,null,null,null,null,null,null,0,0,0,0,0,0,3,{"$f":"MATCH($AM16,標準報酬等級表!$F$8:$F$57,1)","v":1},{"$f":"LOOKUP(AO16,標準報酬等級表!$A$8:$A$57,標準報酬等級表!$D$8:$D$57)","v":58},1,{"$f":"LOOKUP(AQ16,標準報酬等級表!$B$11:$B$42,標準報酬等級表!$D$11:$D$42)","v":88},1,{"$f":"LOOKUP(AS16,標準報酬等級表!$B$11:$B$42,標準報酬等級表!$D$11:$D$42)","v":88},0,null,null,null,1]
[null,null,null,null,null,null,37,2,null,null,null,null,null,null,null,null,null,null,null,{"$f":"LOOKUP(S17,標準報酬等級表!$A$8:$A$57,標準報酬等級表!$D$8:$D$57)","v":{"$error":"#N/A"}},1,{"$f":"LOOKUP(U17,標準報酬等級表!$B$11:$B$42,標準報酬等級表!$D$11:$D$42)","v":88},1,{"$f":"LOOKUP(W17,標準報酬等級表!$B$11:$B$42,標準報酬等級表!$D$11:$D$42)","v":88},null,null,null,null,null,null,null,null,null,0,0,0,0,0,0,3,{"$f":"MATCH($AM17,標準報酬等級表!$F$8:$F$57,1)","v":1},{"$f":"LOOKUP(AO17,標準報酬等級表!$A$8:$A$57,標準報酬等級表!$D$8:$D$57)","v":58},1,{"$f":"LOOKUP(AQ17,標準報酬等級表!$B$11:$B$42,標準報酬等級表!$D$11:$D$42)","v":88},1,{"$f":"LOOKUP(AS17,標準報酬等級表!$B$11:$B$42,標準報酬等級表!$D$11:$D$42)","v":88},0,null,null,null,1]
[null,null,null,null,null,null,37,2,null,null,null,null,null,null,null,null,null,null,null,{"$f":"LOOKUP(S18,標準報酬等級表!$A$8:$A$57,標準報酬等級表!$D$8:$D$57)","v":{"$error":"#N/A"}},1,{"$f":"LOOKUP(U18,標準報酬等級表!$B$11:$B$42,標準報酬等級表!$D$11:$D$42)","v":88},1,{"$f":"LOOKUP(W18,標準報酬等級表!$B$11:$B$42,標準報酬等級表!$D$11:$D$42)","v":88},null,null,null,null,null,null,null,null,null,0,0,0,0,0,0,3,{"$f":"MATCH($AM18,標準報酬等級表!$F$8:$F$57,1)","v":1},{"$f":"LOOKUP(AO18,標準報酬等級表!$A$8:$A$57,標準報酬等級表!$D$8:$D$57)","v":58},1,{"$f":"LOOKUP(AQ18,標準報酬等級表!$B$11:$B$42,標準報酬等級表!$D$11:$D$42)","v":88},1,{"$f":"LOOKUP(AS18,標準報酬等級表!$B$11:$B$42,標準報酬等級表!$D$11:$D$42)","v":88},0,null,null,null,1]
[null,null,null,null,null,null,37,2,null,null,null,null,null,null,null,null,null,null,null,{"$f":"LOOKUP(S19,標準報酬等級表!$A$8:$A$57,標準報酬等級表!$D$8:$D$57)","v":{"$error":"#N/A"}},1,{"$f":"LOOKUP(U19,標準報酬等級表!$B$11:$B$42,標準報酬等級表!$D$11:$D$42)","v":88},1,{"$f":"LOOKUP(W19,標準報酬等級表!$B$11:$B$42,標準報酬等級表!$D$11:$D$42)","v":88},null,null,null,null,null,null,null,null,null,0,0,0,0,0,0,3,{"$f":"MATCH($AM19,標準報酬等級表!$F$8:$F$57,1)","v":1},{"$f":"LOOKUP(AO19,標準報酬等級表!$A$8:$A$57,標準報酬等級表!$D$8:$D$57)","v":58},1,{"$f":"LOOKUP(AQ19,標準報酬等級表!$B$11:$B$42,標準報酬等級表!$D$11:$D$42)","v":88},1,{"$f":"LOOKUP(AS19,標準報酬等級表!$B$11:$B$42,標準報酬等級表!$D$11:$D$42)","v":88},0,null,null,null,1]
[null,null,null,null,null,null,37,2,null,null,null,null,null,null,null,null,null,null,null,{"$f":"LOOKUP(S20,標準報酬等級表!$A$8:$A$57,標準報酬等級表!$D$8:$D$57)","v":{"$error":"#N/A"}},1,{"$f":"LOOKUP(U20,標準報酬等級表!$B$11:$B$42,標準報酬等級表!$D$11:$D$42)","v":88},1,{"$f":"LOOKUP(W20,標準報酬等級表!$B$11:$B$42,標準報酬等級表!$D$11:$D$42)","v":88},null,null,null,null,null,null,null,null,null,0,0,0,0,0,0,3,{"$f":"MATCH($AM20,標準報酬等級表!$F$8:$F$57,1)","v":1},{"$f":"LOOKUP(AO20,標準報酬等級表!$A$8:$A$57,標準報酬等級表!$D$8:$D$57)","v":58},1,{"$f":"LOOKUP(AQ20,標準報酬等級表!$B$11:$B$42,標準報酬等級表!$D$11:$D$42)","v":88},1,{"$f":"LOOKUP(AS20,標準報酬等級表!$B$11:$B$42,標準報酬等級表!$D$11:$D$42)","v":88},0,null,null,null,1]
[null,null,null,null,null,null,37,2,null,null,null,null,null,null,null,null,null,null,null,{"$f":"LOOKUP(S21,標準報酬等級表!$A$8:$A$57,標準報酬等級表!$D$8:$D$57)","v":{"$error":"#N/A"}},1,{"$f":"LOOKUP(U21,標準報酬等級表!$B$11:$B$42,標準報酬等級表!$D$11:$D$42)","v":88},1,{"$f":"LOOKUP(W21,標準報酬等級表!$B$11:$B$42,標準報酬等級表!$D$11:$D$42)","v":88},null,null,null,null,null,null,null,null,null,0,0,0,0,0,0,3,{"$f":"MATCH($AM21,標準報酬等級表!$F$8:$F$57,1)","v":1},{"$f":"LOOKUP(AO21,標準報酬等級表!$A$8:$A$57,標準報酬等級表!$D$8:$D$57)","v":58},1,{"$f":"LOOKUP(AQ21,標準報酬等級表!$B$11:$B$42,標準報酬等級表!$D$11:$D$42)","v":88},1,{"$f":"LOOKUP(AS21,標準報酬等級表!$B$11:$B$42,標準報酬等級表!$D$11:$D$42)","v":88},0,null,null,null,1]
[null,null,null,null,null,null,37,2,null,null,null,null,null,null,null,null,null,null,null,{"$f":"LOOKUP(S22,標準報酬等級表!$A$8:$A$57,標準報酬等級表!$D$8:$D$57)","v":{"$error":"#N/A"}},1,{"$f":"LOOKUP(U22,標準報酬等級表!$B$11:$B$42,標準報酬等級表!$D$11:$D$42)","v":88},1,{"$f":"LOOKUP(W22,標準報酬等級表!$B$11:$B$42,標準報酬等級表!$D$11:$D$42)","v":88},null,null,null,null,null,null,null,null,null,0,0,0,0,0,0,3,{"$f":"MATCH($AM22,標準報酬等級表!$F$8:$F$57,1)","v":1},{"$f":"LOOKUP(AO22,標準報酬等級表!$A$8:$A$57,標準報酬等級表!$D$8:$D$57)","v":58},1,{"$f":"LOOKUP(AQ22,標準報酬等級表!$B$11:$B$42,標準報酬等級表!$D$11:$D$42)","v":88},1,{"$f":"LOOKUP(AS22,標準報酬等級表!$B$11:$B$42,標準報酬等級表!$D$11:$D$42)","v":88},0,null,null,null,1]
[null,null,null,null,null,null,37,2,null,null,null,null,null,null,null,null,null,null,null,{"$f":"LOOKUP(S23,標準報酬等級表!$A$8:$A$57,標準報酬等級表!$D$8:$D$57)","v":{"$error":"#N/A"}},1,{"$f":"LOOKUP(U23,標準報酬等級表!$B$11:$B$42,標準報酬等級表!$D$11:$D$42)","v":88},1,{"$f":"LOOKUP(W23,標準報酬等級表!$B$11:$B$42,標準報酬等級表!$D$11:$D$42)","v":88},null,null,null,null,null,null,null,null,null,0,0,0,0,0,0,3,{"$f":"MATCH($AM23,標準報酬等級表!$F$8:$F$57,1)","v":1},{"$f":"LOOKUP(AO23,標準報酬等級表!$A$8:$A$57,標準報酬等級表!$D$8:$D$57)","v":58},1,{"$f":"LOOKUP(AQ23,標準報酬等級表!$B$11:$B$42,標準報酬等級表!$D$11:$D$42)","v":88},1,{"$f":"LOOKUP(AS23,標準報酬等級表!$B$11:$B$42,標準報酬等級表!$D$11:$D$42)","v":88},0,null,null,null,1]
[null,null,null,null,null,null,37,2,null,null,null,null,null,null,null,null,null,null,null,{"$f":"LOOKUP(S24,標準報酬等級表!$A$8:$A$57,標準報酬等級表!$D$8:$D$57)","v":{"$error":"#N/A"}},1,{"$f":"LOOKUP(U24,標準報酬等級表!$B$11:$B$42,標準報酬等級表!$D$11:$D$42)","v":88},1,{"$f":"LOOKUP(W24,標準報酬等級表!$B$11:$B$42,標準報酬等級表!$D$11:$D$42)","v":88},null,null,null,null,null,null,null,null,null,0,0,0,0,0,0,3,{"$f":"MATCH($AM24,標準報酬等級表!$F$8:$F$57,1)","v":1},{"$f":"LOOKUP(AO24,標準報酬等級表!$A$8:$A$57,標準報酬等級表!$D$8:$D$57)","v":58},1,{"$f":"LOOKUP(AQ24,標準報酬等級表!$B$11:$B$42,標準報酬等級表!$D$11:$D$42)","v":88},1,{"$f":"LOOKUP(AS24,標準報酬等級表!$B$11:$B$42,標準報酬等級表!$D$11:$D$42)","v":88},0,null,null,null,1]
[null,null,null,null,null,null,37,2,null,null,null,null,null,null,null,null,null,null,null,{"$f":"LOOKUP(S25,標準報酬等級表!$A$8:$A$57,標準報酬等級表!$D$8:$D$57)","v":{"$error":"#N/A"}},1,{"$f":"LOOKUP(U25,標準報酬等級表!$B$11:$B$42,標準報酬等級表!$D$11:$D$42)","v":88},1,{"$f":"LOOKUP(W25,標準報酬等級表!$B$11:$B$42,標準報酬等級表!$D$11:$D$42)","v":88},null,null,null,null,null,null,null,null,null,0,0,0,0,0,0,3,{"$f":"MATCH($AM25,標準報酬等級表!$F$8:$F$57,1)","v":1},{"$f":"LOOKUP(AO25,標準報酬等級表!$A$8:$A$57,標準報酬等級表!$D$8:$D$57)","v":58},1,{"$f":"LOOKUP(AQ25,標準報酬等級表!$B$11:$B$42,標準報酬等級表!$D$11:$D$42)","v":88},1,{"$f":"LOOKUP(AS25,標準報酬等級表!$B$11:$B$42,標準報酬等級表!$D$11:$D$42)","v":88},0,null,null,null,1]
[null,null,null,null,null,null,37,2,null,null,null,null,null,null,null,null,null,null,null,{"$f":"LOOKUP(S26,標準報酬等級表!$A$8:$A$57,標準報酬等級表!$D$8:$D$57)","v":{"$error":"#N/A"}},1,{"$f":"LOOKUP(U26,標準報酬等級表!$B$11:$B$42,標準報酬等級表!$D$11:$D$42)","v":88},1,{"$f":"LOOKUP(W26,標準報酬等級表!$B$11:$B$42,標準報酬等級表!$D$11:$D$42)","v":88},null,null,null,null,null,null,null,null,null,0,0,0,0,0,0,3,{"$f":"MATCH($AM26,標準報酬等級表!$F$8:$F$57,1)","v":1},{"$f":"LOOKUP(AO26,標準報酬等級表!$A$8:$A$57,標準報酬等級表!$D$8:$D$57)","v":58},1,{"$f":"LOOKUP(AQ26,標準報酬等級表!$B$11:$B$42,標準報酬等級表!$D$11:$D$42)","v":88},1,{"$f":"LOOKUP(AS26,標準報酬等級表!$B$11:$B$42,標準報酬等級表!$D$11:$D$42)","v":88},0,null,null,null,1]
[null,null,null,null,null,null,37,2,null,null,null,null,null,null,null,null,null,null,null,{"$f":"LOOKUP(S27,標準報酬等級表!$A$8:$A$57,標準報酬等級表!$D$8:$D$57)","v":{"$error":"#N/A"}},1,{"$f":"LOOKUP(U27,標準報酬等級表!$B$11:$B$42,標準報酬等級表!$D$11:$D$42)","v":88},1,{"$f":"LOOKUP(W27,標準報酬等級表!$B$11:$B$42,標準報酬等級表!$D$11:$D$42)","v":88},null,null,null,null,null,null,null,null,null,0,0,0,0,0,0,3,{"$f":"MATCH($AM27,標準報酬等級表!$F$8:$F$57,1)","v":1},{"$f":"LOOKUP(AO27,標準報酬等級表!$A$8:$A$57,標準報酬等級表!$D$8:$D$57)","v":58},1,{"$f":"LOOKUP(AQ27,標準報酬等級表!$B$11:$B$42,標準報酬等級表!$D$11:$D$42)","v":88},1,{"$f":"LOOKUP(AS27,標準報酬等級表!$B$11:$B$42,標準報酬等級表!$D$11:$D$42)","v":88},0,null,null,null,1]
[null,null,null,null,null,null,37,2,null,null,null,null,null,null,null,null,null,null,null,{"$f":"LOOKUP(S28,標準報酬等級表!$A$8:$A$57,標準報酬等級表!$D$8:$D$57)","v":{"$error":"#N/A"}},1,{"$f":"LOOKUP(U28,標準報酬等級表!$B$11:$B$42,標準報酬等級表!$D$11:$D$42)","v":88},1,{"$f":"LOOKUP(W28,標準報酬等級表!$B$11:$B$42,標準報酬等級表!$D$11:$D$42)","v":88},null,null,null,null,null,null,null,null,null,0,0,0,0,0,0,3,{"$f":"MATCH($AM28,標準報酬等級表!$F$8:$F$57,1)","v":1},{"$f":"LOOKUP(AO28,標準報酬等級表!$A$8:$A$57,標準報酬等級表!$D$8:$D$57)","v":58},1,{"$f":"LOOKUP(AQ28,標準報酬等級表!$B$11:$B$42,標準報酬等級表!$D$11:$D$42)","v":88},1,{"$f":"LOOKUP(AS28,標準報酬等級表!$B$11:$B$42,標準報酬等級表!$D$11:$D$42)","v":88},0,null,null,null,1]
[null,null,null,null,null,null,37,2,null,null,null,null,null,null,null,null,null,null,null,{"$f":"LOOKUP(S29,標準報酬等級表!$A$8:$A$57,標準報酬等級表!$D$8:$D$57)","v":{"$error":"#N/A"}},1,{"$f":"LOOKUP(U29,標準報酬等級表!$B$11:$B$42,標準報酬等級表!$D$11:$D$42)","v":88},1,{"$f":"LOOKUP(W29,標準報酬等級表!$B$11:$B$42,標準報酬等級表!$D$11:$D$42)","v":88},null,null,null,null,null,null,null,null,null,0,0,0,0,0,0,3,{"$f":"MATCH($AM29,標準報酬等級表!$F$8:$F$57,1)","v":1},{"$f":"LOOKUP(AO29,標準報酬等級表!$A$8:$A$57,標準報酬等級表!$D$8:$D$57)","v":58},1,{"$f":"LOOKUP(AQ29,標準報酬等級表!$B$11:$B$42,標準報酬等級表!$D$11:$D$42)","v":88},1,{"$f":"LOOKUP(AS29,標準報酬等級表!$B$11:$B$42,標準報酬等級表!$D$11:$D$42)","v":88},0,null,null,null,1]
[null,null,null,null,null,null,37,2,null,null,null,null,null,null,null,null,null,null,null,{"$f":"LOOKUP(S30,標準報酬等級表!$A$8:$A$57,標準報酬等級表!$D$8:$D$57)","v":{"$error":"#N/A"}},1,{"$f":"LOOKUP(U30,標準報酬等級表!$B$11:$B$42,標準報酬等級表!$D$11:$D$42)","v":88},1,{"$f":"LOOKUP(W30,標準報酬等級表!$B$11:$B$42,標準報酬等級表!$D$11:$D$42)","v":88},null,null,null,null,null,null,null,null,null,0,0,0,0,0,0,3,{"$f":"MATCH($AM30,標準報酬等級表!$F$8:$F$57,1)","v":1},{"$f":"LOOKUP(AO30,標準報酬等級表!$A$8:$A$57,標準報酬等級表!$D$8:$D$57)","v":58},1,{"$f":"LOOKUP(AQ30,標準報酬等級表!$B$11:$B$42,標準報酬等級表!$D$11:$D$42)","v":88},1,{"$f":"LOOKUP(AS30,標準報酬等級表!$B$11:$B$42,標準報酬等級表!$D$11:$D$42)","v":88},0,null,null,null,1]
{"$rows_left_out":121}
{"sheet":"使用方法","index":1,"n_rows":30,"n_cols":36,"rows_kept":30,"cut":false,"hidden":false,"merged":[[0,37,0,48],[3,1,23,24],[0,1,1,11],[26,1,27,11],[29,1,49,24]]}
[null,"随時改定等入力用ファイルの使用方法について",null,null,null,null,null,null,null,null,null,null,null,null,null,null,null,null,null,null,null,null,null,null,null,null,null,null,null,null,null,null,null,null,null,"　　　"]
[]
[]
[null,"○　随時改定等の種類に応じて、種類欄に該当の番号を入力し、塗りつぶされていないセルに必要事項を入力してください。\n\n○　灰色のセルは、自動計算、固定値または入力不要の欄なので、入力しないでください。\n\n○　訂正の報告をする際は、処理区分を「３」にしてください。\n\n○　随時改定の保険者算定として資格取得時決定と同様の方法により標準報酬を算定する（即時改定）場合であって、任用の変更等により当月に\n　給与の支給がないため翌月に２ヶ月分の掛金を徴収することを希望する組合員については、掛金翌月欄に「*」を入力してください。\n\n○　年間平均保険者算定により、以前報告した随時改定の取り消しをする場合は、種類「５」を選択し、理由、所属所、証番号、異動年月日を入\n　力してください。理由欄には、取り消しを行う旨を記載してください。その欄以外への入力は不要です。\n\n○　短期組合員について、厚年及び退職に係る標準報酬の欄に入力されたデータを削除する必要はありません。\n\n○　「共済組合用」のボタンについては、当組合で使用しますので、誤ってクリックしないようにお願いいたします。"]
[]
[]
[]
[]
[]
[]
[]
[]
[]
[]
[]
[]
[]
[]
[]
[]
[]
[]
[]
[]
[]
[]
[null,"随時改定等を行うに当たっての注意事項"]
[]
[]
[null,"○　随時改定を行う場合、固定的給与と報酬平均額のいずれも増額または減額となっている必要があります。したがって、固定的給与は増額した\n　が非固定的給与が減額したため報酬平均額が減額した場合またはその逆の場合には、随時改定の対象となりませんのでご注意ください。\n\n○　年間平均による保険者算定を行う場合、別途「年間報酬の平均で算定することの申立書（随時改定用）」及び「標準報酬随時改定届・保険者\n　算定申立に係る例年の状況、標準報酬の月額の比較及び組合員の同意等（随時改定用）」の提出が必要です。\n\n○　育児休業終了時改定を行う場合、別途「標準報酬育児休業等終了時改定申出書」の提出が必要です。\n\n○　産前産後休業終了時改定を行う場合、別途「標準報酬産前産後休業終了時改定申出書」の提出が必要です。なお、産前産後休業終了日の翌日\n　に育児休業等を開始している場合は、産前産後休業終了時改定の対象とはなりませんのでご注意ください。\n\n○　①常勤職員が引き続きフルタイム再任用職員として任用された場合、②当組合の異動事由には当たらないが、組合員が各所属所内の厚生年金\n　適用事業所の変更等により厚生年金に係る標準報酬について資格取得時決定を行う場合は、本入力ファイルを用いて即時改定の報告を行ってく\n　ださい。なお、②に該当する場合、別途日本年金機構より受けた標準報酬の決定に係る通知の写しの提出が必要です。"]
{"$rows_left_out":1}
{"sheet":"リスト","index":2,"n_rows":7,"n_cols":1,"rows_kept":7,"cut":false,"hidden":true,"merged":[]}
[1]
[2]
[3]
[4]
[5]
[6]
[7]

{"sheet":"標準報酬等級表","index":3,"n_rows":57,"n_cols":27,"rows_kept":57,"cut":false,"hidden":true,"merged":[[54,25,54,26],[43,25,43,26],[44,25,44,26],[45,25,45,26],[46,25,46,26],[47,25,47,26],[48,25,48,26],[49,25,49,26],[50,25,50,26],[51,25,51,26],[52,25,52,26],[53,25,53,26],[42,25,42,26],[31,25,31,26],[32,25,32,26],[33,25,33,26],[34,25,34,26],[35,25,35,26],[36,25,36,26],[37,25,37,26],[38,25,38,26],[39,25,39,26],[40,25,40,26],[41,25,41,26],[30,25,30,26],[11,24,11,25],[19,24,19,25],[20,24,20,25],[22,25,22,26],[23,25,23,26],[24,25,24,26],[25,25,25,26],[26,25,26,26],[27,25,27,26],[28,25,28,26],[29,25,29,26],[10,24,10,25],[4,17,6,17],[4,18,6,18],[4,19,6,19],[4,20,6,20],[4,21,6,21],[4,22,6,22],[4,16,6,16],[0,9,0,13],[0,15,0,17],[0,19,0,20],[1,16,1,17],[3,15,3,21],[4,11,6,11],[4,12,6,12],[4,13,6,13],[4,14,6,14],[4,15,6,15],[4,0,4,4],[4,5,5,7],[4,8,6,8],[4,9,6,9],[4,10,6,10],[5,0,6,0],[5,1,6,1],[5,2,6,2],[5,3,6,3],[5,4,6,4]]}
[null,null,null,null,null,null,null,null,null,"掛金率・保険料率（千分率）",null,null,null,null,null,"割引率",null,null,null,"任継掛金率（千分率）"]
[null,null,null,null,null,null,null,null,null,"短期","介護","厚生年金","退職等","保健",null,"1+7",{"$f":"VLOOKUP($P$2,$Y$23:$Z$55,2,FALSE)","v":7.9092282000000003},null,null,{"$f":"Z3","v":95.04},{"$f":"AA3","v":17.12},null,null,null,"令和3年度",94.84,17.760000000000002]
[null,null,null,null,null,null,null,null,null,50.58,8.56,183,7.5,1.4750000000000001,null,null,null,null,null,null,null,null,null,null,"令和4年度",95.04,17.12]
[null,null,null,null,null,null,null,null,null,null,null,null,null,null,null,"任継掛金"]
["標準報酬",null,null,null,null,"報酬月額",null,null,"１等級\n格差\n（円）","短期\n掛金\n（円）","介護\n掛金\n（円）","厚生年金\n組合員\n負担分（円）","退職等\n年金\n掛金（円）","保健\n掛金\n（円）","等級","標準報酬\n月額\n(千円)","短期\n掛金\n月額（円）","介護\n掛金\n月額（円）","掛金\n月額\n合計（円）","前納\n短期\n掛金（円）","前納\n介護\n掛金（円）","前納\n掛金\n合計（円）","等級",null,"2019-09-30","人数","標準報酬（千円）"]
["短期","退職","厚年","月額\n(千円)","日額\n（円）",null,null,null,null,null,5.44,null,7.5,1.4750000000000001,null,null,null,5.44,5.44,5.44,5.44,5.44,null,null,"70歳未満",13806,5270744]
[null,null,null,null,null,"円以上",null,"円未満",null,null,null,null,null,null,null,null,null,null,null,null,null,null,null,null,"70-74歳",10,8220]
[1,null,null,58,{"$f":"ROUND(D8*1000/22,-1)","v":2640},0,"～",63000,null,{"$f":"ROUNDDOWN($D8*J$3,0)","v":2933},496,{"$f":"ROUNDDOWN($D8*L$3/2,0)","v":5307},{"$f":"ROUNDDOWN($D8*M$3,0)","v":435},85,1,null,null,null,null,null,null,null,null,null,"任意継続",130,44814]
[2,null,null,68,3090,63000,"～",73000,8000,3439,582,6222,510,100,1,{"$f":"D9","v":68},{"$f":"ROUNDDOWN($D9*T$2,0)","v":6462},1164,{"$f":"SUM(Q9:R9)","v":7626},{"$f":"ROUND(Q9*$Q$2,0)","v":51109},9206,{"$f":"SUM(T9:U9)","v":60315},1,null,"合計",{"$f":"SUM(Z6:Z8)","v":13946},{"$f":"SUM(AA6:AA8)","v":5323778}]
[3,null,null,78,3550,73000,"～",83000,{"$f":"H10-F10","v":10000},3945,667,7137,585,115,2,78,7413,1335,8748,58631,10559,69190,2]
[4,1,1,88,4000,83000,"～",93000,10000,4451,753,8052,660,129,3,88,8363,1506,9869,66145,11911,78056,3,null,"平均標準報酬月額",null,{"$f":"(AA9/Z9)*1000","v":381742.29169654381}]
[5,2,2,98,4450,93000,"～",101000,8000,4956,838,8967,735,144,4,98,9313,1677,10990,73659,13264,86923,4,null,"22等級",null,380000]
[6,3,3,104,4730,101000,"～",107000,6000,5260,890,9516,780,153,5,104,9884,1780,11664,78175,14078,92253,5]
[7,4,4,110,5000,107000,"～",114000,7000,5563,941,10065,825,162,6,110,10454,1883,12337,82683,14893,97576,6,null,"2022-09-30","人数","標準報酬（千円）"]
[8,5,5,118,5360,114000,"～",122000,8000,5968,1010,10797,885,174,7,118,11214,2020,13234,88694,15977,104671,7,null,"70歳未満",14413,5376500]
[9,6,6,126,5730,122000,"～",130000,8000,6373,1078,11529,945,185,8,126,11975,2157,14132,94713,17060,111773,8,null,"70-74歳",30,20380]
[10,7,7,134,6090,130000,"～",138000,8000,6777,1147,12261,1005,197,9,134,12735,2294,15029,100724,18144,118868,9,null,"任意継続",135,41800]
[11,8,8,142,6450,138000,"～",146000,8000,7182,1215,12993,1065,209,10,142,13495,2431,15926,106735,19227,125962,10,null,"合計",{"$f":"SUM(Z15:Z17)","v":14578},{"$f":"SUM(AA15:AA17)","v":5438680}]
[12,9,9,150,6820,146000,"～",155000,9000,7587,1284,13725,1125,221,11,150,14256,2568,16824,112754,20311,133065,11]
[13,10,10,160,7270,155000,"～",165000,10000,8092,1369,14640,1200,236,12,160,15206,2739,17945,120268,21663,141931,12,null,"平均標準報酬月額",null,{"$f":"(AA18/Z18)*1000","v":373074.49581561255}]
[14,11,11,170,7730,165000,"～",175000,10000,8598,1455,15555,1275,250,13,170,16156,2910,19066,127781,23016,150797,13,null,"22等級",null,380000]
[15,12,12,180,8180,175000,"～",185000,10000,9104,1540,16470,1350,265,14,180,17107,{"$f":"ROUNDDOWN($D22*U$2,0)","v":3081},20188,135303,24368,159671,14]
[16,13,13,190,8640,185000,"～",195000,10000,9610,1626,17385,1425,280,15,190,18057,3252,21309,142817,25721,168538,15,null,"-1年-"]
[17,14,14,200,9090,195000,"～",210000,15000,10116,1712,18300,1500,295,16,200,19008,3424,22432,150339,27081,177420,16,null,"1+11",{"$f":"1+10.7869636","v":11.7869636}]
[18,15,15,220,10000,210000,"～",230000,20000,11127,1883,20130,1650,324,17,220,20908,3766,24674,165366,29786,195152,17,null,"1+10",{"$f":"1+9.8222773","v":10.8222773}]
[19,16,16,240,10910,230000,"～",250000,20000,12139,2054,21960,1800,354,18,240,22809,4108,26917,180402,32491,212893,18,null,"1+9",{"$f":"1+8.8544329","v":9.8544329000000008}]
[20,17,17,260,11820,250000,"～",270000,20000,13150,2225,23790,1950,383,19,260,24710,4451,29161,195437,35204,230641,19,null,"1+8",{"$f":"1+7.88342","v":8.883420000000001}]
[21,18,18,280,12730,270000,"～",290000,20000,{"$f":"ROUNDDOWN($D28*J$3,0)","v":14162},2396,25620,2100,413,20,280,26611,4793,31404,210472,37909,248381,20,null,"1+7",{"$f":"1+6.9092282","v":7.9092282000000003}]
[22,19,19,300,13640,290000,"～",310000,20000,15174,2568,27450,2250,442,21,300,28512,5136,33648,225508,40622,266130,21,null,"1+6",{"$f":"1+5.9318472","v":6.9318472}]
[23,20,20,320,14550,310000,"～",330000,20000,16185,2739,29280,2400,472,22,320,30412,5478,35890,240535,43327,283862,22,null,"2+9",{"$f":"2+8.8544329","v":10.854432900000001}]
{"$rows_left_out":27}